{"text_format":"3","workbook":"xlsx","n_sheets":2,"sheets":["Laskutus","Asiakasrekisteri"],"not_rendered":{"images":1,"defined_names":2,"comments":2},"read":"whole","date_system":"1900"}

{"sheet":"Laskutus","index":0,"n_rows":34,"n_cols":11,"rows_kept":34}
[{"$nulls":5},"Laskunro",101]
[{"$nulls":5},"Sivunro",null,null,"Päivä","Kuukausi","Vuosi"]
[{"$nulls":8},{"$f":"DAY(G4)","v":8},{"$f":"MONTH(G4)","v":10},{"$f":"YEAR(G4)","v":2015}]
[null," Ruittulankuja 3",{"$nulls":3},"Laskupvm",{"$f":"TODAY()+1","v":"2015-10-08"}]
[null," 33333 Servosuo",{"$nulls":3},"Maksuaika",{"v":14,"d":"14 pv"}]
[{"$nulls":5},"Eräpäivä",{"$f":"G4+G5","v":"2015-10-22"}]
[]
["As.nro"]
["Asiakas",{"$f":"IF(B8=\"\",\"\",VLOOKUP($B$8,Asiakasrekisteri!$A$2:$H$15,2,FALSE))","v":""}]
["Katuos.",{"$f":"IF(B8=\"\",\"\",VLOOKUP($B$8,Asiakasrekisteri!$A$2:$H$15,5,FALSE))","v":""},{"$nulls":3},"Viitenumero"]
["Postitsto",{"$f":"IF(B8=\"\",\"\",VLOOKUP($B$8,Asiakasrekisteri!$A$2:$H$15,6,FALSE)&\" \"&VLOOKUP($B$8,Asiakasrekisteri!$A$2:$H$15,7,FALSE))","v":""},{"$nulls":3},"Viivästyskorko:",{"v":0.11,"d":"11.0 %"}]
[]
[null,null,{"$f":"IF(B13=TRUE,10 %,0%)","v":{"v":0,"d":"0%"}},null,null,"Luokitus"]
[]
[]
[{"$nulls":6},{"$f":"IF(G15=4,22%,IF(G15=3,17%,IF(G15=2,8%,0%)))","v":{"v":0,"d":"0%"}}]
{"$rows_empty":16}
["Y-tunnus: 39989999-09",{"$nulls":3},"Web-sivu:","www.ratkiriemu.fi"]
[{"$nulls":4},"E-mail","kari.oja@ratkiriemu.fi"]

{"sheet":"Asiakasrekisteri","index":1,"n_rows":15,"n_cols":8,"rows_kept":15}
["As nro","Yritys","Yhteyshenkilö","Sukunimi","Osoite","Postinumero","Postitoimipaikka","Puhelin"]
[1,"AB-Elektro Oy","Boris","Virtanen","Kävelykatu 2",40630,"Jyväskylä","014 222 222"]
[2,"Herkon kauppa","Herkko","Heponen","Kavioura 3",40630,"Jyväskylä","014 354 4321"]
[3,"Info-Systems","Jenni","Jaakkola","PL  21",40251,"Jyväskylä","014 345 1234"]
[4,"Info-Systems Ky","Jenni","Jaakkola","PL   21",40251,"Jyväskylä","014 345 1234"]
[5,"Isofirma Oyj","Alma","Mäkinen","PL 2",40101,"Jyväskylä","0400 727 987"]
[6,"Koulutus Oy","Esa","Erikoinen","PL 25",40201,"Jyväskylä","0400 222 3456"]
[7,"MoniToimi Oy","Minni","Peltonen","Rantakatu 4",40400,"Jyväskylä","050 543 1234"]
[8,"Suksikauppa Oy","Simo","Suihko","Latutie 5",40800,"Jyväskylä","040 987 1234"]
[9,"Tekstintuotto Oy","Emma","Järvinen","Metsänreuna  2",40640,"Jyväskylä","0400 177 938"]
[11,"Tmi Kukka ja risu","Kauno","Tuhat","Lehtikuja 12",40350,"Jyväskylä","040 345 6778"]
[12,"Tontun torttu ja tuli T:mi","Essi","Rajula","Kujakatu 3",20100,"Turku","050 90 909 090"]
[13,"Harjun kala","Urpo","Majava","Avenue 13","20340","Turku","(02) 333 5678"]
[14,"Kollaan kuppi ja kannu","Auli","Ojasivu","Tiekuja 3","20780","Turku","(02) 456 7890"]
[15,"Helmisen sulka ja sato","Erkki","Juurekas","Avenuekuja 11","30200","Tampere","(03) 678 9999"]